solicitation-n
type: LexicalEntry
canonical form: solicitation
sense: 07202433-n
part of speech: noun

07202433-n
type: LexicalConcept
in scheme: en-word.net
definition: an entreaty addressed to someone of superior status
example: a solicitation to the king for relief
ili: i74425
lexfile: noun.communication
part of speech: noun
hypernym: 07201488-n