discord-n
type: LexicalEntry
canonical form: discord
sense: 07196206-n
part of speech: noun

dissension-n
type: LexicalEntry
canonical form: dissension
sense: 07196206-n
part of speech: noun

07196206-n
type: LexicalConcept
in scheme: en-word.net
definition: disagreement among those expected to cooperate
ili: i74393
lexfile: noun.communication
part of speech: noun
hypernym: 07195447-n