acceptance-n
type: LexicalEntry
canonical form: acceptance
sense: 07190724-n
part of speech: noun

07190724-n
type: LexicalConcept
in scheme: en-word.net
definition: (contract law) words signifying consent to the terms of an offer (thereby creating a contract)
ili: i74362
lexfile: noun.communication
part of speech: noun
domain topic: 06171758-n
hypernym: 07190226-n