reading-n
type: LexicalEntry
canonical form: reading
sense: 07188417-n
part of speech: noun

07188417-n
type: LexicalConcept
in scheme: en-word.net
definition: a particular interpretation or performance
example: on that reading, it was an insult
example: he was famous for his reading of Mozart
ili: i74351
lexfile: noun.communication
part of speech: noun
hypernym: 07185404-n