version-n
type: LexicalEntry
canonical form: version
sense: 07188236-n
part of speech: noun

07188236-n
type: LexicalConcept
in scheme: en-word.net
definition: an interpretation of a matter from a particular viewpoint
example: his version of the fight was different from mine
ili: i74350
lexfile: noun.communication
part of speech: noun
hypernym: 07185404-n