summons-n
type: LexicalEntry
canonical form: summons
sense: 07183749-n
part of speech: noun

07183749-n
type: LexicalConcept
in scheme: en-word.net
definition: an order to appear in person at a given place and time
ili: i74326
lexfile: noun.communication
part of speech: noun
hypernym: 07183274-n