price-n
type: LexicalEntry
canonical form: price
sense: 07181692-n
part of speech: noun

07181692-n
type: LexicalConcept
in scheme: en-word.net
definition: a monetary reward for helping to catch a criminal
example: the cattle thief has a price on his head
ili: i74316
lexfile: noun.communication
part of speech: noun
hypernym: 07180932-n