consideration-n
type: LexicalEntry
canonical form: consideration
sense: 07153623-n
part of speech: noun

07153623-n
type: LexicalConcept
in scheme: en-word.net
definition: a discussion of a topic (as in a meeting)
example: consideration of the traffic problem took more than an hour
ili: i74179
lexfile: noun.communication
part of speech: noun
hypernym: 07152793-n