suction stop-n
type: LexicalEntry
canonical form: suction stop
sense: 07132918-n
part of speech: noun

click-n
type: LexicalEntry
canonical form: click
sense: 07132918-n
part of speech: noun

07132918-n
type: LexicalConcept
in scheme: en-word.net
definition: a stop consonant made by the suction of air into the mouth (as in Bantu)
ili: i74068
lexfile: noun.communication
part of speech: noun
hypernym: 07130622-n