plosion-n
type: LexicalEntry
canonical form: plosion
sense: 07131151-n
part of speech: noun

explosion-n
type: LexicalEntry
canonical form: explosion
sense: 07131151-n
part of speech: noun

07131151-n
type: LexicalConcept
in scheme: en-word.net
definition: the terminal forced release of pressure built up during the occlusive phase of a stop consonant
ili: i74057
lexfile: noun.communication
part of speech: noun
hypernym: 00211789-n