utterance-n
type: LexicalEntry
canonical form: utterance
sense: 07124555-n
part of speech: noun

vocalization-n
type: LexicalEntry
canonical form: vocalization
sense: 07124555-n
part of speech: noun

07124555-n
type: LexicalConcept
in scheme: en-word.net
definition: the use of uttered sounds for auditory communication
ili: i74024
lexfile: noun.communication
part of speech: noun
hypernym: 07123727-n
mero part: 07125755-n