conversion-n
type: LexicalEntry
canonical form: conversion
sense: 07117149-n
part of speech: noun

07117149-n
type: LexicalConcept
in scheme: en-word.net
definition: interchange of subject and predicate of a proposition
ili: i73984
lexfile: noun.communication
part of speech: noun
hypernym: 07112859-n