repetition-n
type: LexicalEntry
canonical form: repetition
sense: 07113937-n
part of speech: noun

07113937-n
type: LexicalConcept
in scheme: en-word.net
definition: the repeated use of the same word or word pattern as a rhetorical device
ili: i73962
lexfile: noun.communication
part of speech: noun
hypernym: 07112859-n