monotone-n
type: LexicalEntry
canonical form: monotone
sense: 07098939-n
part of speech: noun

07098939-n
type: LexicalConcept
in scheme: en-word.net
definition: a single tone repeated with different words or different rhythms (especially in rendering liturgical texts)
ili: i73879
lexfile: noun.communication
part of speech: noun
hypernym: 06878395-n