parlance-n
type: LexicalEntry
canonical form: parlance
sense: 07095369-n
part of speech: noun

idiom-n
type: LexicalEntry
canonical form: idiom
sense: 07095369-n
part of speech: noun

07095369-n
type: LexicalConcept
in scheme: en-word.net
definition: a manner of speaking that is natural to native speakers of a language
ili: i73859
lexfile: noun.communication
part of speech: noun
hypernym: 07083988-n