catch-n
type: LexicalEntry
canonical form: catch
sense: 07081800-n
part of speech: noun

07081800-n
type: LexicalConcept
in scheme: en-word.net
definition: a break or check in the voice (usually a sign of strong emotion)
ili: i73821
lexfile: noun.communication
part of speech: noun
hypernym: 07085523-n