statement-n
type: LexicalEntry
canonical form: statement
sense: 07043306-n
part of speech: noun

07043306-n
type: LexicalConcept
in scheme: en-word.net
definition: (music) the presentation of a musical theme
example: the initial statement of the sonata
ili: i73594
lexfile: noun.communication
part of speech: noun
domain topic: 07034009-n
hypernym: 07042734-n