variety show-n
type: LexicalEntry
canonical form: variety show
sense: 07033353-n
part of speech: noun

variety-n
type: LexicalEntry
canonical form: variety
sense: 07033353-n
part of speech: noun

07033353-n
type: LexicalConcept
in scheme: en-word.net
definition: a show consisting of a series of short unrelated performances
ili: i73562
lexfile: noun.communication
part of speech: noun
hypernym: 00521313-n