tragedy-n
type: LexicalEntry
canonical form: tragedy
sense: 07030062-n
part of speech: noun

07030062-n
type: LexicalConcept
in scheme: en-word.net
definition: drama in which the protagonist is overcome by some superior force or circumstance; excites terror or pity
ili: i73540
lexfile: noun.communication
part of speech: noun
hypernym: 06387777-n