prompt-n
type: LexicalEntry
canonical form: prompt
sense: 07024919-n
part of speech: noun

prompting-n
type: LexicalEntry
canonical form: prompting
sense: 07024919-n
part of speech: noun

07024919-n
type: LexicalConcept
in scheme: en-word.net
definition: a cue given to a performer (usually the beginning of the next line to be spoken)
example: the audience could hear his prompting
ili: i73509
lexfile: noun.communication
part of speech: noun
hypernym: 07024325-n