act-n
type: LexicalEntry
canonical form: act
sense: 07022756-n
part of speech: noun

07022756-n
type: LexicalConcept
in scheme: en-word.net
definition: a subdivision of a play or opera or ballet
ili: i73496
lexfile: noun.communication
part of speech: noun
hypernym: 07020800-n
mero part: 07022924-n