Chechen-n
type: LexicalEntry
canonical form: Chechen
sense: 06991082-n
part of speech: noun

Chechen language-n
type: LexicalEntry
canonical form: Chechen language
sense: 06991082-n
part of speech: noun

06991082-n
type: LexicalConcept
in scheme: en-word.net
definition: a northern Caucasian language spoken by the Chechen
ili: i73296
lexfile: noun.communication
part of speech: noun
hypernym: 06990840-n