French-n
type: LexicalEntry
canonical form: French
sense: 06977643-n
part of speech: noun

French language-n
type: LexicalEntry
canonical form: French language
sense: 06977643-n
part of speech: noun

06977643-n
type: LexicalConcept
in scheme: en-word.net
definition: the Romance language spoken in France and in countries colonized by France
ili: i73211
lexfile: noun.communication
part of speech: noun
domain region: 08949695-n
hypernym: 06976693-n