Manx-n
type: LexicalEntry
canonical form: Manx
sense: 06973961-n
part of speech: noun

Manx language-n
type: LexicalEntry
canonical form: Manx language
sense: 06973961-n
part of speech: noun

06973961-n
type: LexicalConcept
in scheme: en-word.net
definition: the ancient Gaelic formerly spoken on the Isle of Man; the language is sometimes used on ceremonial occasions
ili: i73188
lexfile: noun.communication
part of speech: noun
hypernym: 06973306-n