Serbo-Croat-n
type: LexicalEntry
canonical form: Serbo-Croat
sense: 06957857-n
part of speech: noun

Serbo-Croatian-n
type: LexicalEntry
canonical form: Serbo-Croatian
sense: 06957857-n
part of speech: noun

06957857-n
type: LexicalConcept
in scheme: en-word.net
definition: the Slavic language of the Serbs and Croats; the Serbian dialect is usually written in the Cyrillic alphabet and the Croatian dialect is usually written in the Roman alphabet
ili: i73094
lexfile: noun.communication
part of speech: noun
hypernym: 06956533-n