badge-n
type: LexicalEntry
canonical form: badge
sense: 06895611-n
part of speech: noun

06895611-n
type: LexicalConcept
in scheme: en-word.net
definition: an emblem (a small piece of plastic or cloth or metal) that signifies your status (rank or membership or affiliation etc.)
example: they checked everyone's badge before letting them in
ili: i72668
lexfile: noun.communication
part of speech: noun
hypernym: 06893714-n