gesture-n
type: LexicalEntry
canonical form: gesture
sense: 06889359-n
part of speech: noun

motion-n
type: LexicalEntry
canonical form: motion
sense: 06889359-n
part of speech: noun

06889359-n
type: LexicalConcept
in scheme: en-word.net
definition: the use of movements (especially of the hands) to communicate familiar or prearranged signals
ili: i72632
lexfile: noun.communication
part of speech: noun
hypernym: 06886302-n