space-n
type: LexicalEntry
canonical form: space
sense: 06852240-n
part of speech: noun

blank-n
type: LexicalEntry
canonical form: blank
sense: 06852240-n
part of speech: noun

06852240-n
type: LexicalConcept
in scheme: en-word.net
definition: a blank character used to separate successive words in writing or printing
example: he said the space is the most important character in the alphabet
ili: i72459
lexfile: noun.communication
part of speech: noun
hypernym: 06831828-n