superscript-n
type: LexicalEntry
canonical form: superscript
sense: 06832889-n
part of speech: noun

superior-n
type: LexicalEntry
canonical form: superior
sense: 06832889-n
part of speech: noun

06832889-n
type: LexicalConcept
in scheme: en-word.net
definition: a character or symbol set or printed or written above and immediately to one side of another character
ili: i72332
lexfile: noun.communication
part of speech: noun
hypernym: 06831828-n