formula-n
type: LexicalEntry
canonical form: formula
sense: 06829793-n
part of speech: noun

chemical formula-n
type: LexicalEntry
canonical form: chemical formula
sense: 06829793-n
part of speech: noun

06829793-n
type: LexicalConcept
in scheme: en-word.net
definition: a representation of a substance using symbols for its constituent elements
ili: i72317
lexfile: noun.communication
part of speech: noun
hypernym: 06735202-n
mero part: 06829643-n