signpost-n
type: LexicalEntry
canonical form: signpost
sense: 06807231-n
part of speech: noun

guidepost-n
type: LexicalEntry
canonical form: guidepost
sense: 06807231-n
part of speech: noun

06807231-n
type: LexicalConcept
in scheme: en-word.net
definition: a post bearing a sign that gives directions or shows the way
ili: i72188
lexfile: noun.communication
part of speech: noun
hypernym: 06806088-n