direction-n
type: LexicalEntry
canonical form: direction
sense: 06799486-n
part of speech: noun

instruction-n
type: LexicalEntry
canonical form: instruction
sense: 06799486-n
part of speech: noun

06799486-n
type: LexicalConcept
in scheme: en-word.net
definition: a message describing how something is to be done
example: he gave directions faster than she could follow them
ili: i72152
lexfile: noun.communication
part of speech: noun
hypernym: 06611268-n