alliance-n
type: LexicalEntry
canonical form: alliance
sense: 06786485-n
part of speech: noun

06786485-n
type: LexicalConcept
in scheme: en-word.net
definition: a formal agreement establishing an association or alliance between nations or other groups to achieve a particular aim
ili: i72084
lexfile: noun.communication
part of speech: noun
hypernym: 06786235-n