obiter dictum-n
type: LexicalEntry
canonical form: obiter dictum
sense: 06778678-n
part of speech: noun

dictum-n
type: LexicalEntry
canonical form: dictum
sense: 06778678-n
part of speech: noun

06778678-n
type: LexicalConcept
in scheme: en-word.net
definition: an opinion voiced by a judge on a point of law not directly bearing on the case in question and therefore not binding
ili: i72043
lexfile: noun.communication
part of speech: noun
domain topic: 08458195-n
hypernym: 06563775-n