gambit-n
type: LexicalEntry
canonical form: gambit
sense: 06778322-n
part of speech: noun

ploy-n
type: LexicalEntry
canonical form: ploy
sense: 06778322-n
part of speech: noun

06778322-n
type: LexicalConcept
in scheme: en-word.net
definition: an opening remark intended to secure an advantage for the speaker
ili: i72041
lexfile: noun.communication
part of speech: noun
hypernym: 06777755-n