oracle-n
type: LexicalEntry
canonical form: oracle
sense: 06763053-n
part of speech: noun

06763053-n
type: LexicalConcept
in scheme: en-word.net
definition: a prophecy (usually obscure or allegorical) revealed by a priest or priestess; believed to be infallible
ili: i71967
lexfile: noun.communication
part of speech: noun
hypernym: 06762868-n