caveat-n
type: LexicalEntry
canonical form: caveat
sense: 06760621-n
part of speech: noun

06760621-n
type: LexicalConcept
in scheme: en-word.net
definition: (law) a formal notice filed with a court or officer to suspend a proceeding until filer is given a hearing
example: a caveat filed against the probate of a will
ili: i71954
lexfile: noun.communication
part of speech: noun
domain topic: 08458195-n
hypernym: 06760383-n