notice-n
type: LexicalEntry
canonical form: notice
sense: 06760383-n
part of speech: noun

06760383-n
type: LexicalConcept
in scheme: en-word.net
definition: an announcement containing information about an event
example: you didn't give me enough notice
example: an obituary notice
example: a notice of sale
ili: i71953
lexfile: noun.communication
part of speech: noun
hypernym: 06759293-n