representation-n
type: LexicalEntry
canonical form: representation
sense: 06752531-n
part of speech: noun

06752531-n
type: LexicalConcept
in scheme: en-word.net
definition: a statement of facts and reasons made in appealing or protesting
example: certain representations were made concerning police brutality
ili: i71916
lexfile: noun.communication
part of speech: noun
hypernym: 06735202-n