profession-n
type: LexicalEntry
canonical form: profession
sense: 06745674-n
part of speech: noun

professing-n
type: LexicalEntry
canonical form: professing
sense: 06745674-n
part of speech: noun

06745674-n
type: LexicalConcept
in scheme: en-word.net
definition: an open avowal (true or false) of some belief or opinion
example: a profession of disagreement
ili: i71881
lexfile: noun.communication
part of speech: noun
hypernym: 06745099-n