testimony-n
type: LexicalEntry
canonical form: testimony
sense: 06745459-n
part of speech: noun

06745459-n
type: LexicalConcept
in scheme: en-word.net
definition: an assertion offering firsthand authentication of a fact
example: according to his own testimony he can't do it
ili: i71880
lexfile: noun.communication
part of speech: noun
hypernym: 06742248-n