citation-n
type: LexicalEntry
canonical form: citation
sense: 06718888-n
part of speech: noun

commendation-n
type: LexicalEntry
canonical form: commendation
sense: 06718888-n
part of speech: noun

06718888-n
type: LexicalConcept
in scheme: en-word.net
definition: an official award (as for bravery or service) usually given as formal public statement
ili: i71746
lexfile: noun.communication
part of speech: noun
hypernym: 06709228-n