profession-n
type: LexicalEntry
canonical form: profession
sense: 06697785-n
part of speech: noun

06697785-n
type: LexicalConcept
in scheme: en-word.net
definition: affirmation of acceptance of some religion or faith
example: a profession of Christianity
ili: i71616
lexfile: noun.communication
part of speech: noun
hypernym: 06697543-n