advice-n
type: LexicalEntry
canonical form: advice
sense: 06684229-n
part of speech: noun

06684229-n
type: LexicalConcept
in scheme: en-word.net
definition: a proposal for an appropriate course of action
ili: i71545
lexfile: noun.communication
part of speech: noun
hypernym: 07176845-n