demonstration-n
type: LexicalEntry
canonical form: demonstration
sense: 06660791-n
part of speech: noun

monstrance-n
type: LexicalEntry
canonical form: monstrance
sense: 06660791-n
part of speech: noun

06660791-n
type: LexicalConcept
in scheme: en-word.net
definition: proof by a process of argument or a series of proposition proving an asserted conclusion
ili: i71415
lexfile: noun.communication
part of speech: noun
hypernym: 06660359-n