database-n
type: LexicalEntry
canonical form: database
sense: 06650349-n
part of speech: noun

06650349-n
type: LexicalConcept
in scheme: en-word.net
definition: an organized body of related information
ili: i71362
lexfile: noun.communication
part of speech: noun
hypernym: 06646883-n