greeting-n
type: LexicalEntry
canonical form: greeting
sense: 06642524-n
part of speech: noun

salutation-n
type: LexicalEntry
canonical form: salutation
sense: 06642524-n
part of speech: noun

06642524-n
type: LexicalConcept
in scheme: en-word.net
definition: (usually plural) an acknowledgment or expression of good will (especially on meeting)
ili: i71323
lexfile: noun.communication
part of speech: noun
exemplifies: 06306016-n
hypernym: 06641368-n