pulp-n
type: LexicalEntry
canonical form: pulp
sense: 06608811-n
part of speech: noun

pulp magazine-n
type: LexicalEntry
canonical form: pulp magazine
sense: 06608811-n
part of speech: noun

06608811-n
type: LexicalConcept
in scheme: en-word.net
definition: an inexpensive magazine printed on poor quality paper
ili: i71125
lexfile: noun.communication
part of speech: noun
hypernym: 06607555-n