collection-n
type: LexicalEntry
canonical form: collection
sense: 06603723-n
part of speech: noun

compendium-n
type: LexicalEntry
canonical form: compendium
sense: 06603723-n
part of speech: noun

06603723-n
type: LexicalConcept
in scheme: en-word.net
definition: a publication containing a variety of works
ili: i71095
lexfile: noun.communication
part of speech: noun
hypernym: 06601855-n