frame-n
type: LexicalEntry
canonical form: frame
sense: 06582981-n
part of speech: noun

06582981-n
type: LexicalConcept
in scheme: en-word.net
definition: an application that divides the user's display into two or more windows that can be scrolled independently
ili: i70979
lexfile: noun.communication
part of speech: noun
hypernym: 06582286-n